Book 6.3, Chapter 5.11

This page is part of my LFS Diary. HTML CSS
lfs [ /mnt/lfs/sources/WORK/gcc-build ]# make -k check
make[1]: Entering directory `/mnt/lfs/sources/WORK/gcc-build'
make[2]: Entering directory `/mnt/lfs/sources/WORK/gcc-build/fixincludes'
autogen -T ../../gcc-4.1.2/fixincludes/check.tpl ../../gcc-4.1.2/fixincludes/inc
make[2]: autogen: Command not found
make[2]: *** [check] Error 127
make[2]: Leaving directory `/mnt/lfs/sources/WORK/gcc-build/fixincludes'
make[1]: *** [check-fixincludes] Error 2
make[2]: Entering directory `/mnt/lfs/sources/WORK/gcc-build/gcc'
Making a new config file...
echo "set tmpdir /mnt/lfs/sources/WORK/gcc-build/gcc/testsuite" >> ./tmp0
test -d testsuite || mkdir testsuite
test -d testsuite/gcc || mkdir testsuite/gcc
(rootme=`${PWDCMD-pwd}`; export rootme; \
        srcdir=`cd ../../gcc-4.1.2/gcc; ${PWDCMD-pwd}` ; export srcdir ; \
        cd testsuite/gcc; \
        rm -f tmp-site.exp; \
        sed '/set tmpdir/ s|testsuite|testsuite/gcc|' \
                < ../../site.exp > tmp-site.exp; \
        /bin/sh ${srcdir}/../move-if-change tmp-site.exp site.exp; \
        EXPECT=expect ; export EXPECT ; \
        if [ -f ${rootme}/../expect/expect ] ; then  \
           TCL_LIBRARY=`cd .. ; cd ${srcdir}/../tcl/library ; ${PWDCMD-pwd}` ; \
            export TCL_LIBRARY ; fi ; \
        runtest --tool gcc )
WARNING: Couldn't find the global config file.
Test Run By lfs on Mon May 26 06:20:57 2008
Native configuration is i686-pc-linux-gnu

                === gcc tests ===

Schedule of variations:
    unix

Running target unix
Using /tools/share/dejagnu/baseboards/unix.exp as board description file for tar
Using /tools/share/dejagnu/config/unix.exp as generic interface file for target.
Using /mnt/lfs/sources/WORK/gcc-4.1.2/gcc/testsuite/config/default.exp as tool-a
Running /mnt/lfs/sources/WORK/gcc-4.1.2/gcc/testsuite/gcc.c-torture/compile/comp
WARNING: program timed out.
FAIL: gcc.c-torture/compile/20001226-1.c  -O2  (test for excess errors)
WARNING: program timed out.
FAIL: gcc.c-torture/compile/20001226-1.c  -O3 -fomit-frame-pointer  (test for excess errors)
WARNING: program timed out.
FAIL: gcc.c-torture/compile/20001226-1.c  -O3 -g  (test for excess errors)
WARNING: program timed out.
FAIL: gcc.c-torture/compile/20001226-1.c  -Os  (test for excess errors)
Running /mnt/lfs/sources/WORK/gcc-4.1.2/gcc/testsuite/gcc.c-torture/execute/builtins/builtins.exp ...
Running /mnt/lfs/sources/WORK/gcc-4.1.2/gcc/testsuite/gcc.c-torture/execute/execute.exp ...
Running /mnt/lfs/sources/WORK/gcc-4.1.2/gcc/testsuite/gcc.c-torture/execute/ieee/ieee.exp ...
Running /mnt/lfs/sources/WORK/gcc-4.1.2/gcc/testsuite/gcc.c-torture/unsorted/unsorted.exp ...
Running /mnt/lfs/sources/WORK/gcc-4.1.2/gcc/testsuite/gcc.dg/charset/charset.exp ...
Running /mnt/lfs/sources/WORK/gcc-4.1.2/gcc/testsuite/gcc.dg/compat/compat.exp ...
Running /mnt/lfs/sources/WORK/gcc-4.1.2/gcc/testsuite/gcc.dg/compat/struct-layout-1.exp ...
Running /mnt/lfs/sources/WORK/gcc-4.1.2/gcc/testsuite/gcc.dg/cpp/cpp.exp ...
Running /mnt/lfs/sources/WORK/gcc-4.1.2/gcc/testsuite/gcc.dg/cpp/trad/trad.exp ...
Running /mnt/lfs/sources/WORK/gcc-4.1.2/gcc/testsuite/gcc.dg/debug/debug.exp ...
Running /mnt/lfs/sources/WORK/gcc-4.1.2/gcc/testsuite/gcc.dg/debug/dwarf2/dwarf2.exp ...
Running /mnt/lfs/sources/WORK/gcc-4.1.2/gcc/testsuite/gcc.dg/dg.exp ...
Running /mnt/lfs/sources/WORK/gcc-4.1.2/gcc/testsuite/gcc.dg/format/format.exp ...
Running /mnt/lfs/sources/WORK/gcc-4.1.2/gcc/testsuite/gcc.dg/ipa/ipa.exp ...
Running /mnt/lfs/sources/WORK/gcc-4.1.2/gcc/testsuite/gcc.dg/noncompile/noncompile.exp ...
Running /mnt/lfs/sources/WORK/gcc-4.1.2/gcc/testsuite/gcc.dg/pch/pch.exp ...
Running /mnt/lfs/sources/WORK/gcc-4.1.2/gcc/testsuite/gcc.dg/special/mips-abi.exp ...
Running /mnt/lfs/sources/WORK/gcc-4.1.2/gcc/testsuite/gcc.dg/special/special.exp ...
Running /mnt/lfs/sources/WORK/gcc-4.1.2/gcc/testsuite/gcc.dg/tls/tls.exp ...
Running /mnt/lfs/sources/WORK/gcc-4.1.2/gcc/testsuite/gcc.dg/torture/dg-torture.exp ...
Running /mnt/lfs/sources/WORK/gcc-4.1.2/gcc/testsuite/gcc.dg/tree-prof/tree-prof.exp ...
Running /mnt/lfs/sources/WORK/gcc-4.1.2/gcc/testsuite/gcc.dg/tree-ssa/tree-ssa.exp ...
Running /mnt/lfs/sources/WORK/gcc-4.1.2/gcc/testsuite/gcc.dg/vect/vect.exp ...
Running /mnt/lfs/sources/WORK/gcc-4.1.2/gcc/testsuite/gcc.dg/vmx/vmx.exp ...
Running /mnt/lfs/sources/WORK/gcc-4.1.2/gcc/testsuite/gcc.dg/weak/weak.exp ...
Running /mnt/lfs/sources/WORK/gcc-4.1.2/gcc/testsuite/gcc.misc-tests/acker1.exp ...
Running /mnt/lfs/sources/WORK/gcc-4.1.2/gcc/testsuite/gcc.misc-tests/arm-isr.exp ...
Running /mnt/lfs/sources/WORK/gcc-4.1.2/gcc/testsuite/gcc.misc-tests/bprob.exp ...
Running /mnt/lfs/sources/WORK/gcc-4.1.2/gcc/testsuite/gcc.misc-tests/dhry.exp ...
Running /mnt/lfs/sources/WORK/gcc-4.1.2/gcc/testsuite/gcc.misc-tests/gcov.exp ...
Running /mnt/lfs/sources/WORK/gcc-4.1.2/gcc/testsuite/gcc.misc-tests/i386-prefetch.exp ...
Running /mnt/lfs/sources/WORK/gcc-4.1.2/gcc/testsuite/gcc.misc-tests/linkage.exp ...
Running /mnt/lfs/sources/WORK/gcc-4.1.2/gcc/testsuite/gcc.misc-tests/matrix1.exp ...
Running /mnt/lfs/sources/WORK/gcc-4.1.2/gcc/testsuite/gcc.misc-tests/mg-2.exp ...
Running /mnt/lfs/sources/WORK/gcc-4.1.2/gcc/testsuite/gcc.misc-tests/mg.exp ...
Running /mnt/lfs/sources/WORK/gcc-4.1.2/gcc/testsuite/gcc.misc-tests/options.exp ...
Running /mnt/lfs/sources/WORK/gcc-4.1.2/gcc/testsuite/gcc.misc-tests/sieve.exp ...
Running /mnt/lfs/sources/WORK/gcc-4.1.2/gcc/testsuite/gcc.misc-tests/sort2.exp ...
Running /mnt/lfs/sources/WORK/gcc-4.1.2/gcc/testsuite/gcc.target/alpha/alpha.exp ...
Running /mnt/lfs/sources/WORK/gcc-4.1.2/gcc/testsuite/gcc.target/arm/arm.exp ...
Running /mnt/lfs/sources/WORK/gcc-4.1.2/gcc/testsuite/gcc.target/cris/cris.exp ...
Running /mnt/lfs/sources/WORK/gcc-4.1.2/gcc/testsuite/gcc.target/cris/torture/cris-torture.exp ...
Running /mnt/lfs/sources/WORK/gcc-4.1.2/gcc/testsuite/gcc.target/frv/frv.exp ...
Running /mnt/lfs/sources/WORK/gcc-4.1.2/gcc/testsuite/gcc.target/i386/i386.exp ...
FAIL: gcc.target/i386/fastcall-sseregparm.c execution test
Running /mnt/lfs/sources/WORK/gcc-4.1.2/gcc/testsuite/gcc.target/ia64/ia64.exp ...
Running /mnt/lfs/sources/WORK/gcc-4.1.2/gcc/testsuite/gcc.target/mips/mips.exp ...
Running /mnt/lfs/sources/WORK/gcc-4.1.2/gcc/testsuite/gcc.target/powerpc/powerpc.exp ...
Running /mnt/lfs/sources/WORK/gcc-4.1.2/gcc/testsuite/gcc.target/sparc/sparc.exp ...
Running /mnt/lfs/sources/WORK/gcc-4.1.2/gcc/testsuite/gcc.target/x86_64/abi/abi-x86_64.exp ...
Running /mnt/lfs/sources/WORK/gcc-4.1.2/gcc/testsuite/gcc.target/xstormy16/xstormy16.exp ...
Running /mnt/lfs/sources/WORK/gcc-4.1.2/gcc/testsuite/gcc.test-framework/test-framework.exp ...
skipping test framework tests, CHECK_TEST_FRAMEWORK is not defined

                === gcc Summary ===

# of expected passes            38980
# of unexpected failures        5
# of expected failures          101
# of untested testcases         28
# of unsupported tests          246
/mnt/lfs/sources/WORK/gcc-build/gcc/xgcc  version 4.1.2

make[2]: [check-gcc] Error 1 (ignored)
test -d testsuite || mkdir testsuite
test -d testsuite/g++ || mkdir testsuite/g++
(rootme=`${PWDCMD-pwd}`; export rootme; \
        srcdir=`cd ../../gcc-4.1.2/gcc; ${PWDCMD-pwd}` ; export srcdir ; \
        cd testsuite/g++; \
        rm -f tmp-site.exp; \
        sed '/set tmpdir/ s|testsuite|testsuite/g++|' \
                < ../../site.exp > tmp-site.exp; \
        /bin/sh ${srcdir}/../move-if-change tmp-site.exp site.exp; \
        EXPECT=expect ; export EXPECT ; \
        if [ -f ${rootme}/../expect/expect ] ; then  \
           TCL_LIBRARY=`cd .. ; cd ${srcdir}/../tcl/library ; ${PWDCMD-pwd}` ; \
            export TCL_LIBRARY ; fi ; \
        runtest --tool g++ )
WARNING: Couldn't find the global config file.
Test Run By lfs on Mon May 26 08:57:28 2008
Native configuration is i686-pc-linux-gnu

                === g++ tests ===

Schedule of variations:
    unix

Running target unix
Using /tools/share/dejagnu/baseboards/unix.exp as board description file for target.
Using /tools/share/dejagnu/config/unix.exp as generic interface file for target.
Using /mnt/lfs/sources/WORK/gcc-4.1.2/gcc/testsuite/config/default.exp as tool-and-target-specific interface file.
Running /mnt/lfs/sources/WORK/gcc-4.1.2/gcc/testsuite/g++.dg/bprob/bprob.exp ...
Running /mnt/lfs/sources/WORK/gcc-4.1.2/gcc/testsuite/g++.dg/charset/charset.exp ...
Running /mnt/lfs/sources/WORK/gcc-4.1.2/gcc/testsuite/g++.dg/compat/compat.exp ...
Running /mnt/lfs/sources/WORK/gcc-4.1.2/gcc/testsuite/g++.dg/compat/struct-layout-1.exp ...
Running /mnt/lfs/sources/WORK/gcc-4.1.2/gcc/testsuite/g++.dg/debug/debug.exp ...
Running /mnt/lfs/sources/WORK/gcc-4.1.2/gcc/testsuite/g++.dg/dg.exp ...
XPASS: g++.dg/tree-ssa/pr14814.C scan-tree-dump-times &this 0
Running /mnt/lfs/sources/WORK/gcc-4.1.2/gcc/testsuite/g++.dg/gcov/gcov.exp ...
Running /mnt/lfs/sources/WORK/gcc-4.1.2/gcc/testsuite/g++.dg/pch/pch.exp ...
Running /mnt/lfs/sources/WORK/gcc-4.1.2/gcc/testsuite/g++.dg/special/ecos.exp ...
Running /mnt/lfs/sources/WORK/gcc-4.1.2/gcc/testsuite/g++.dg/tls/tls.exp ...
Running /mnt/lfs/sources/WORK/gcc-4.1.2/gcc/testsuite/g++.dg/vect/vect.exp ...
Running /mnt/lfs/sources/WORK/gcc-4.1.2/gcc/testsuite/g++.old-deja/old-deja.exp ...
XPASS: g++.old-deja/g++.other/init5.C execution test

                === g++ Summary ===

# of expected passes            12408
# of unexpected successes       2
# of expected failures          66
# of unsupported tests          69
/mnt/lfs/sources/WORK/gcc-build/gcc/testsuite/g++/../../g++  version 4.1.2

make[2]: [check-g++] Error 1 (ignored)
make[2]: Leaving directory `/mnt/lfs/sources/WORK/gcc-build/gcc'
make[2]: Entering directory `/mnt/lfs/sources/WORK/gcc-build/intl'
make[2]: Nothing to be done for `check'.
make[2]: Leaving directory `/mnt/lfs/sources/WORK/gcc-build/intl'
make[2]: Entering directory `/mnt/lfs/sources/WORK/gcc-build/libcpp'
make[2]: Nothing to be done for `check'.
make[2]: Leaving directory `/mnt/lfs/sources/WORK/gcc-build/libcpp'
make[2]: Entering directory `/mnt/lfs/sources/WORK/gcc-build/libiberty'
make[3]: Entering directory `/mnt/lfs/sources/WORK/gcc-build/libiberty/testsuite'
gcc -DHAVE_CONFIG_H -g -O2  -I.. -I../../../gcc-4.1.2/libiberty/testsuite/../../include  -o test-demangle \
                ../../../gcc-4.1.2/libiberty/testsuite/test-demangle.c ../libiberty.a
./test-demangle < ../../../gcc-4.1.2/libiberty/testsuite/demangle-expected
./test-demangle: 748 tests, 0 failures
gcc -DHAVE_CONFIG_H -g -O2  -I.. -I../../../gcc-4.1.2/libiberty/testsuite/../../include  -DHAVE_CONFIG_H -I.. -o test-pexecute \
                ../../../gcc-4.1.2/libiberty/testsuite/test-pexecute.c ../libiberty.a
./test-pexecute
make[3]: Leaving directory `/mnt/lfs/sources/WORK/gcc-build/libiberty/testsuite'
make[2]: Leaving directory `/mnt/lfs/sources/WORK/gcc-build/libiberty'
make[1]: Target `check-host' not remade because of errors.
make[2]: Entering directory `/mnt/lfs/sources/WORK/gcc-build/i686-pc-linux-gnu/libstdc++-v3'
Making check in include
make[3]: Entering directory `/mnt/lfs/sources/WORK/gcc-build/i686-pc-linux-gnu/libstdc++-v3/include'
make[3]: Nothing to be done for `check'.
make[3]: Leaving directory `/mnt/lfs/sources/WORK/gcc-build/i686-pc-linux-gnu/libstdc++-v3/include'
Making check in libsupc++
make[3]: Entering directory `/mnt/lfs/sources/WORK/gcc-build/i686-pc-linux-gnu/libstdc++-v3/libsupc++'
make[3]: Nothing to be done for `check'.
make[3]: Leaving directory `/mnt/lfs/sources/WORK/gcc-build/i686-pc-linux-gnu/libstdc++-v3/libsupc++'
Making check in libmath
make[3]: Entering directory `/mnt/lfs/sources/WORK/gcc-build/i686-pc-linux-gnu/libstdc++-v3/libmath'
make[3]: Nothing to be done for `check'.
make[3]: Leaving directory `/mnt/lfs/sources/WORK/gcc-build/i686-pc-linux-gnu/libstdc++-v3/libmath'
Making check in src
make[3]: Entering directory `/mnt/lfs/sources/WORK/gcc-build/i686-pc-linux-gnu/libstdc++-v3/src'
make[3]: Nothing to be done for `check'.
make[3]: Leaving directory `/mnt/lfs/sources/WORK/gcc-build/i686-pc-linux-gnu/libstdc++-v3/src'
Making check in po
make[3]: Entering directory `/mnt/lfs/sources/WORK/gcc-build/i686-pc-linux-gnu/libstdc++-v3/po'
/bin/sh /mnt/lfs/sources/WORK/gcc-4.1.2/libstdc++-v3/../mkinstalldirs /mnt/lfs/sources/WORK/gcc-build/i686-pc-linux-gnu/libstdc++-v3/po/share/locale
mkdir -p -- /mnt/lfs/sources/WORK/gcc-build/i686-pc-linux-gnu/libstdc++-v3/po/share/locale
catalogs='de.mo fr.mo'; \
        for cat in $catalogs; do \
          cat=`basename $cat`; \
          lang=`echo $cat | sed 's/\.mo$//'`; \
          install_dir=/mnt/lfs/sources/WORK/gcc-build/i686-pc-linux-gnu/libstdc++-v3/po/share/locale/$lang/LC_MESSAGES; \
          /bin/sh /mnt/lfs/sources/WORK/gcc-4.1.2/libstdc++-v3/../mkinstalldirs $install_dir; \
          /usr/bin/install -c -m 644 $cat $install_dir/libstdc++.mo; \
        done
mkdir -p -- /mnt/lfs/sources/WORK/gcc-build/i686-pc-linux-gnu/libstdc++-v3/po/share/locale/de/LC_MESSAGES
mkdir -p -- /mnt/lfs/sources/WORK/gcc-build/i686-pc-linux-gnu/libstdc++-v3/po/share/locale/fr/LC_MESSAGES
make[3]: Leaving directory `/mnt/lfs/sources/WORK/gcc-build/i686-pc-linux-gnu/libstdc++-v3/po'
Making check in testsuite
make[3]: Entering directory `/mnt/lfs/sources/WORK/gcc-build/i686-pc-linux-gnu/libstdc++-v3/testsuite'
make -j1 check-DEJAGNU
make[4]: Entering directory `/mnt/lfs/sources/WORK/gcc-build/i686-pc-linux-gnu/libstdc++-v3/testsuite'
Making a new site.exp file...
srcdir=`CDPATH="${ZSH_VERSION+.}:" && cd ../../../../gcc-4.1.2/libstdc++-v3/testsuite && pwd`; export srcdir; \
        EXPECT=expect; export EXPECT; \
        runtest=runtest; \
        if /bin/sh -c "$runtest --version" > /dev/null 2>&1; then \
          l='libstdc++'; for tool in $l; do \
            $runtest  --tool $tool --srcdir $srcdir ; \
          done; \
        else echo "WARNING: could not find \`runtest'" 1>&2; :;\
        fi
WARNING: Couldn't find the global config file.
Test Run By lfs on Mon May 26 09:53:48 2008
Native configuration is i686-pc-linux-gnu

                === libstdc++ tests ===

Schedule of variations:
    unix

Running target unix
Using /tools/share/dejagnu/baseboards/unix.exp as board description file for target.
Using /tools/share/dejagnu/config/unix.exp as generic interface file for target.
Using /mnt/lfs/sources/WORK/gcc-4.1.2/libstdc++-v3/testsuite/config/default.exp as tool-and-target-specific interface file.
Running /mnt/lfs/sources/WORK/gcc-4.1.2/libstdc++-v3/testsuite/libstdc++-abi/abi.exp ...
Running /mnt/lfs/sources/WORK/gcc-4.1.2/libstdc++-v3/testsuite/libstdc++-dg/normal.exp ...
                === libstdc++ Summary ===

# of expected passes            3398
# of expected failures          13
# of unsupported tests          324
make[4]: Leaving directory `/mnt/lfs/sources/WORK/gcc-build/i686-pc-linux-gnu/libstdc++-v3/testsuite'
make[3]: Leaving directory `/mnt/lfs/sources/WORK/gcc-build/i686-pc-linux-gnu/libstdc++-v3/testsuite'
make[3]: Entering directory `/mnt/lfs/sources/WORK/gcc-build/i686-pc-linux-gnu/libstdc++-v3'
make "AR_FLAGS=rc" "CC_FOR_BUILD=gcc" "CC_FOR_TARGET=/mnt/lfs/sources/WORK/gcc-build/./gcc/xgcc -B/mnt/lfs/sources/WORK/gcc-build/./gcc/ -B/tools/i686-pc-linux-gnu/bin/ -B/tools/i686-pc-linux-gnu/lib/ -isystem /tools/i686-pc-linux-gnu/include -isystem /tools/i686-pc-linux-gnu/sys-include" "CFLAGS=-O2 -g -O2  " "CXXFLAGS=-g -O2  -D_GNU_SOURCE" "CFLAGS_FOR_BUILD=-g -O2 " "CFLAGS_FOR_TARGET=-O2 -g -O2  " "INSTALL=/usr/bin/install -c" "INSTALL_DATA=/usr/bin/install -c -m 644" "INSTALL_PROGRAM=/usr/bin/install -c" "INSTALL_SCRIPT=/usr/bin/install -c" "LDFLAGS=" "LIBCFLAGS=-O2 -g -O2  " "LIBCFLAGS_FOR_TARGET=-O2 -g -O2  " "MAKE=make" "MAKEINFO=makeinfo --split-size=5000000 --split-size=5000000  " "PICFLAG=" "PICFLAG_FOR_TARGET=" "SHELL=/bin/sh" "RUNTESTFLAGS=" "exec_prefix=/tools" "infodir=/tools/info" "libdir=/tools/lib" "includedir=/tools/include" "prefix=/tools" "tooldir=/tools/i686-pc-linux-gnu" "gxx_include_dir=/tools/include/c++/4.1.2" "AR=ar" "AS=/mnt/lfs/sources/WORK/gcc-build/./gcc/as" "LD=/mnt/lfs/sources/WORK/gcc-build/./gcc/collect-ld" "RANLIB=ranlib" "NM=/mnt/lfs/sources/WORK/gcc-build/./gcc/nm" "NM_FOR_BUILD=" "NM_FOR_TARGET=nm" "DESTDIR=" "WERROR=" DO=all multi-do # make
make[4]: Entering directory `/mnt/lfs/sources/WORK/gcc-build/i686-pc-linux-gnu/libstdc++-v3'
if [ -z "" ]; then \
          true; \
        else \
          rootpre=`${PWDCMD-pwd}`/; export rootpre; \
          srcrootpre=`cd ../../../gcc-4.1.2/libstdc++-v3; ${PWDCMD-pwd}`/; export srcrootpre; \
          lib=`echo ${rootpre} | sed -e 's,^.*/\([^/][^/]*\)/$,\1,'`; \
          compiler="/mnt/lfs/sources/WORK/gcc-build/./gcc/xgcc -B/mnt/lfs/sources/WORK/gcc-build/./gcc/ -B/tools/i686-pc-linux-gnu/bin/ -B/tools/i686-pc-linux-gnu/lib/ -isystem /tools/i686-pc-linux-gnu/include -isystem /tools/i686-pc-linux-gnu/sys-include"; \
          for i in `${compiler} --print-multi-lib 2>/dev/null`; do \
            dir=`echo $i | sed -e 's/;.*$//'`; \
            if [ "${dir}" = "." ]; then \
              true; \
            else \
              if [ -d ../${dir}/${lib} ]; then \
                flags=`echo $i | sed -e 's/^[^;]*;//' -e 's/@/ -/g'`; \
                if (cd ../${dir}/${lib}; make "AR_FLAGS=rc" "CC_FOR_BUILD=gcc" "CC_FOR_TARGET=/mnt/lfs/sources/WORK/gcc-build/./gcc/xgcc -B/mnt/lfs/sources/WORK/gcc-build/./gcc/ -B/tools/i686-pc-linux-gnu/bin/ -B/tools/i686-pc-linux-gnu/lib/ -isystem /tools/i686-pc-linux-gnu/include -isystem /tools/i686-pc-linux-gnu/sys-include" "CFLAGS=-O2 -g -O2  " "CXXFLAGS=-g -O2  -D_GNU_SOURCE" "CFLAGS_FOR_BUILD=-g -O2 " "CFLAGS_FOR_TARGET=-O2 -g -O2  " "INSTALL=/usr/bin/install -c" "INSTALL_DATA=/usr/bin/install -c -m 644" "INSTALL_PROGRAM=/usr/bin/install -c" "INSTALL_SCRIPT=/usr/bin/install -c" "LDFLAGS=" "LIBCFLAGS=-O2 -g -O2  " "LIBCFLAGS_FOR_TARGET=-O2 -g -O2  " "MAKE=make" "MAKEINFO=makeinfo --split-size=5000000 --split-size=5000000   " "PICFLAG=" "PICFLAG_FOR_TARGET=" "SHELL=/bin/sh" "RUNTESTFLAGS=" "exec_prefix=/tools" "infodir=/tools/info" "libdir=/tools/lib" "includedir=/tools/include" "prefix=/tools" "tooldir=/tools/i686-pc-linux-gnu" "gxx_include_dir=/tools/include/c++/4.1.2" "AR=ar" "AS=/mnt/lfs/sources/WORK/gcc-build/./gcc/as" "LD=/mnt/lfs/sources/WORK/gcc-build/./gcc/collect-ld" "RANLIB=ranlib" "NM=/mnt/lfs/sources/WORK/gcc-build/./gcc/nm" "NM_FOR_BUILD=" "NM_FOR_TARGET=nm" "DESTDIR=" "WERROR=" \
                                CFLAGS="-O2 -g -O2   ${flags}" \
                                FCFLAGS=" ${flags}" \
                                FFLAGS=" ${flags}" \
                                ADAFLAGS=" ${flags}" \
                                prefix="/tools" \
                                exec_prefix="/tools" \
                                GCJFLAGS=" ${flags}" \
                                CXXFLAGS="-g -O2  -D_GNU_SOURCE ${flags}" \
                                LIBCFLAGS="-O2 -g -O2   ${flags}" \
                                LIBCXXFLAGS="-g -O2  -D_GNU_SOURCE -fno-implicit-templates ${flags}" \
                                LDFLAGS=" ${flags}" \
                                MULTIFLAGS="${flags}" \
                                DESTDIR="" \
                                INSTALL="/usr/bin/install -c" \
                                INSTALL_DATA="/usr/bin/install -c -m 644" \
                                INSTALL_PROGRAM="/usr/bin/install -c" \
                                INSTALL_SCRIPT="/usr/bin/install -c" \
                                all); then \
                  true; \
                else \
                  exit 1; \
                fi; \
              else true; \
              fi; \
            fi; \
          done; \
        fi
make[4]: Leaving directory `/mnt/lfs/sources/WORK/gcc-build/i686-pc-linux-gnu/libstdc++-v3'
make[3]: Leaving directory `/mnt/lfs/sources/WORK/gcc-build/i686-pc-linux-gnu/libstdc++-v3'
make[2]: Leaving directory `/mnt/lfs/sources/WORK/gcc-build/i686-pc-linux-gnu/libstdc++-v3'
make[2]: Entering directory `/mnt/lfs/sources/WORK/gcc-build/i686-pc-linux-gnu/libmudflap'
Making check in testsuite
make[3]: Entering directory `/mnt/lfs/sources/WORK/gcc-build/i686-pc-linux-gnu/libmudflap/testsuite'
make  check-DEJAGNU
make[4]: Entering directory `/mnt/lfs/sources/WORK/gcc-build/i686-pc-linux-gnu/libmudflap/testsuite'
Making a new site.exp file...
srcdir=`CDPATH="${ZSH_VERSION+.}:" && cd ../../../../gcc-4.1.2/libmudflap/testsuite && pwd`; export srcdir; \
        EXPECT=`if [ -f ../../expect/expect ] ; then echo ../../expect/expect ; else echo expect ; fi`; export EXPECT; \
        runtest=`if [ -f ../../../../gcc-4.1.2/libmudflap/testsuite/../../dejagnu/runtest ] ; then echo ../../../../gcc-4.1.2/libmudflap/testsuite/../../dejagnu/runtest ; else echo runtest ;  fi`; \
        if /bin/sh -c "$runtest --version" > /dev/null 2>&1; then \
          l='libmudflap'; for tool in $l; do \
            $runtest  --tool $tool --srcdir $srcdir ; \
          done; \
        else echo "WARNING: could not find \`runtest'" 1>&2; :;\
        fi
WARNING: Couldn't find the global config file.
Test Run By lfs on Mon May 26 12:29:48 2008
Native configuration is i686-pc-linux-gnu

                === libmudflap tests ===

Schedule of variations:
    unix

Running target unix
Using /tools/share/dejagnu/baseboards/unix.exp as board description file for target.
Using /tools/share/dejagnu/config/unix.exp as generic interface file for target.
Using /mnt/lfs/sources/WORK/gcc-4.1.2/libmudflap/testsuite/config/default.exp as tool-and-target-specific interface file.
Running /mnt/lfs/sources/WORK/gcc-4.1.2/libmudflap/testsuite/libmudflap.c/cfrags.exp ...
Running /mnt/lfs/sources/WORK/gcc-4.1.2/libmudflap/testsuite/libmudflap.c/externs.exp ...
Running /mnt/lfs/sources/WORK/gcc-4.1.2/libmudflap/testsuite/libmudflap.c++/c++frags.exp ...
Running /mnt/lfs/sources/WORK/gcc-4.1.2/libmudflap/testsuite/libmudflap.c++/ctors.exp ...
Running /mnt/lfs/sources/WORK/gcc-4.1.2/libmudflap/testsuite/libmudflap.cth/cthfrags.exp ...

                === libmudflap Summary ===

# of expected passes            1799
make[4]: Leaving directory `/mnt/lfs/sources/WORK/gcc-build/i686-pc-linux-gnu/libmudflap/testsuite'
make[3]: Leaving directory `/mnt/lfs/sources/WORK/gcc-build/i686-pc-linux-gnu/libmudflap/testsuite'
make[3]: Entering directory `/mnt/lfs/sources/WORK/gcc-build/i686-pc-linux-gnu/libmudflap'
make "AR_FLAGS=rc" "CC_FOR_BUILD=gcc" "CFLAGS=-O2 -g -O2  " "CXXFLAGS=-g -O2  -D_GNU_SOURCE" "CFLAGS_FOR_BUILD=-g -O2 " "CFLAGS_FOR_TARGET=-O2 -g -O2  " "INSTALL=/usr/bin/install -c" "INSTALL_DATA=/usr/bin/install -c -m 644" "INSTALL_PROGRAM=/usr/bin/install -c" "INSTALL_SCRIPT=/usr/bin/install -c" "JC1FLAGS=" "LDFLAGS=" "LIBCFLAGS=-O2 -g -O2  " "LIBCFLAGS_FOR_TARGET=-O2 -g -O2  " "MAKE=make" "MAKEINFO=makeinfo --split-size=5000000 --split-size=5000000  " "PICFLAG=" "PICFLAG_FOR_TARGET=" "SHELL=/bin/sh" "RUNTESTFLAGS=" "exec_prefix=/tools" "infodir=/tools/info" "libdir=/tools/lib" "prefix=/tools" "includedir=/tools/include" "AR=ar" "AS=/mnt/lfs/sources/WORK/gcc-build/./gcc/as" "CC=/mnt/lfs/sources/WORK/gcc-build/./gcc/xgcc -B/mnt/lfs/sources/WORK/gcc-build/./gcc/ -B/tools/i686-pc-linux-gnu/bin/ -B/tools/i686-pc-linux-gnu/lib/ -isystem /tools/i686-pc-linux-gnu/include -isystem /tools/i686-pc-linux-gnu/sys-include" "CXX=/mnt/lfs/sources/WORK/gcc-build/./gcc/g++ -B/mnt/lfs/sources/WORK/gcc-build/./gcc/ -nostdinc++ -nostdinc++ -I/mnt/lfs/sources/WORK/gcc-build/i686-pc-linux-gnu/libstdc++-v3/include/i686-pc-linux-gnu -I/mnt/lfs/sources/WORK/gcc-build/i686-pc-linux-gnu/libstdc++-v3/include -I/mnt/lfs/sources/WORK/gcc-4.1.2/libstdc++-v3/libsupc++ -I/mnt/lfs/sources/WORK/gcc-4.1.2/libstdc++-v3/include/backward -I/mnt/lfs/sources/WORK/gcc-4.1.2/libstdc++-v3/testsuite -L/mnt/lfs/sources/WORK/gcc-build/i686-pc-linux-gnu/libstdc++-v3/src -L/mnt/lfs/sources/WORK/gcc-build/i686-pc-linux-gnu/libstdc++-v3/src/.libs -B/tools/i686-pc-linux-gnu/bin/ -B/tools/i686-pc-linux-gnu/lib/ -isystem /tools/i686-pc-linux-gnu/include -isystem /tools/i686-pc-linux-gnu/sys-include" "LD=/mnt/lfs/sources/WORK/gcc-build/./gcc/collect-ld" "LIBCFLAGS=-O2 -g -O2  " "NM=/mnt/lfs/sources/WORK/gcc-build/./gcc/nm" "PICFLAG=" "RANLIB=ranlib" "DESTDIR=" DO=all multi-do # make
make[4]: Entering directory `/mnt/lfs/sources/WORK/gcc-build/i686-pc-linux-gnu/libmudflap'
if [ -z "" ]; then \
          true; \
        else \
          rootpre=`${PWDCMD-pwd}`/; export rootpre; \
          srcrootpre=`cd ../../../gcc-4.1.2/libmudflap; ${PWDCMD-pwd}`/; export srcrootpre; \
          lib=`echo ${rootpre} | sed -e 's,^.*/\([^/][^/]*\)/$,\1,'`; \
          compiler="/mnt/lfs/sources/WORK/gcc-build/./gcc/xgcc -B/mnt/lfs/sources/WORK/gcc-build/./gcc/ -B/tools/i686-pc-linux-gnu/bin/ -B/tools/i686-pc-linux-gnu/lib/ -isystem /tools/i686-pc-linux-gnu/include -isystem /tools/i686-pc-linux-gnu/sys-include"; \
          for i in `${compiler} --print-multi-lib 2>/dev/null`; do \
            dir=`echo $i | sed -e 's/;.*$//'`; \
            if [ "${dir}" = "." ]; then \
              true; \
            else \
              if [ -d ../${dir}/${lib} ]; then \
                flags=`echo $i | sed -e 's/^[^;]*;//' -e 's/@/ -/g'`; \
                if (cd ../${dir}/${lib}; make  \
                                CFLAGS="-O2 -g -O2   ${flags}" \
                                FCFLAGS=" ${flags}" \
                                FFLAGS=" ${flags}" \
                                ADAFLAGS=" ${flags}" \
                                prefix="/tools" \
                                exec_prefix="/tools" \
                                GCJFLAGS=" ${flags}" \
                                CXXFLAGS="-g -O2  -D_GNU_SOURCE ${flags}" \
                                LIBCFLAGS="-O2 -g -O2   ${flags}" \
                                LIBCXXFLAGS="-g -O2  -D_GNU_SOURCE -fno-implicit-templates ${flags}" \
                                LDFLAGS=" ${flags}" \
                                MULTIFLAGS="${flags}" \
                                DESTDIR="" \
                                INSTALL="/usr/bin/install -c" \
                                INSTALL_DATA="/usr/bin/install -c -m 644" \
                                INSTALL_PROGRAM="/usr/bin/install -c" \
                                INSTALL_SCRIPT="/usr/bin/install -c" \
                                all); then \
                  true; \
                else \
                  exit 1; \
                fi; \
              else true; \
              fi; \
            fi; \
          done; \
        fi
make[4]: Leaving directory `/mnt/lfs/sources/WORK/gcc-build/i686-pc-linux-gnu/libmudflap'
make[3]: Leaving directory `/mnt/lfs/sources/WORK/gcc-build/i686-pc-linux-gnu/libmudflap'
make[2]: Leaving directory `/mnt/lfs/sources/WORK/gcc-build/i686-pc-linux-gnu/libmudflap'
make[2]: Entering directory `/mnt/lfs/sources/WORK/gcc-build/i686-pc-linux-gnu/libssp'
make "AR_FLAGS=rc" "CC_FOR_BUILD=gcc" "CFLAGS=-O2 -g -O2  " "CXXFLAGS=-g -O2  -D_GNU_SOURCE" "CFLAGS_FOR_BUILD=-g -O2 " "CFLAGS_FOR_TARGET=-O2 -g -O2  " "INSTALL=/usr/bin/install -c" "INSTALL_DATA=/usr/bin/install -c -m 644" "INSTALL_PROGRAM=/usr/bin/install -c" "INSTALL_SCRIPT=/usr/bin/install -c" "JC1FLAGS=" "LDFLAGS=" "LIBCFLAGS=-O2 -g -O2  " "LIBCFLAGS_FOR_TARGET=-O2 -g -O2  " "MAKE=make" "MAKEINFO=makeinfo --split-size=5000000 --split-size=5000000 " "PICFLAG=" "PICFLAG_FOR_TARGET=" "SHELL=/bin/sh" "RUNTESTFLAGS=" "exec_prefix=/tools" "infodir=/tools/info" "libdir=/tools/lib" "prefix=/tools" "includedir=/tools/include" "AR=ar" "AS=/mnt/lfs/sources/WORK/gcc-build/./gcc/as" "CC=/mnt/lfs/sources/WORK/gcc-build/./gcc/xgcc -B/mnt/lfs/sources/WORK/gcc-build/./gcc/ -B/tools/i686-pc-linux-gnu/bin/ -B/tools/i686-pc-linux-gnu/lib/ -isystem /tools/i686-pc-linux-gnu/include -isystem /tools/i686-pc-linux-gnu/sys-include" "CXX=/mnt/lfs/sources/WORK/gcc-build/./gcc/g++ -B/mnt/lfs/sources/WORK/gcc-build/./gcc/ -nostdinc++ -nostdinc++ -I/mnt/lfs/sources/WORK/gcc-build/i686-pc-linux-gnu/libstdc++-v3/include/i686-pc-linux-gnu -I/mnt/lfs/sources/WORK/gcc-build/i686-pc-linux-gnu/libstdc++-v3/include -I/mnt/lfs/sources/WORK/gcc-4.1.2/libstdc++-v3/libsupc++ -I/mnt/lfs/sources/WORK/gcc-4.1.2/libstdc++-v3/include/backward -I/mnt/lfs/sources/WORK/gcc-4.1.2/libstdc++-v3/testsuite -L/mnt/lfs/sources/WORK/gcc-build/i686-pc-linux-gnu/libstdc++-v3/src -L/mnt/lfs/sources/WORK/gcc-build/i686-pc-linux-gnu/libstdc++-v3/src/.libs -B/tools/i686-pc-linux-gnu/bin/ -B/tools/i686-pc-linux-gnu/lib/ -isystem /tools/i686-pc-linux-gnu/include -isystem /tools/i686-pc-linux-gnu/sys-include" "LD=/mnt/lfs/sources/WORK/gcc-build/./gcc/collect-ld" "LIBCFLAGS=-O2 -g -O2  " "NM=/mnt/lfs/sources/WORK/gcc-build/./gcc/nm" "PICFLAG=" "RANLIB=ranlib" "DESTDIR=" DO=all multi-do # make
make[3]: Entering directory `/mnt/lfs/sources/WORK/gcc-build/i686-pc-linux-gnu/libssp'
if [ -z "" ]; then \
          true; \
        else \
          rootpre=`${PWDCMD-pwd}`/; export rootpre; \
          srcrootpre=`cd ../../../gcc-4.1.2/libssp; ${PWDCMD-pwd}`/; export srcrootpre; \
          lib=`echo ${rootpre} | sed -e 's,^.*/\([^/][^/]*\)/$,\1,'`; \
          compiler="/mnt/lfs/sources/WORK/gcc-build/./gcc/xgcc -B/mnt/lfs/sources/WORK/gcc-build/./gcc/ -B/tools/i686-pc-linux-gnu/bin/ -B/tools/i686-pc-linux-gnu/lib/ -isystem /tools/i686-pc-linux-gnu/include -isystem /tools/i686-pc-linux-gnu/sys-include"; \
          for i in `${compiler} --print-multi-lib 2>/dev/null`; do \
            dir=`echo $i | sed -e 's/;.*$//'`; \
            if [ "${dir}" = "." ]; then \
              true; \
            else \
              if [ -d ../${dir}/${lib} ]; then \
                flags=`echo $i | sed -e 's/^[^;]*;//' -e 's/@/ -/g'`; \
                if (cd ../${dir}/${lib}; make  \
                                CFLAGS="-O2 -g -O2   ${flags}" \
                                FCFLAGS=" ${flags}" \
                                FFLAGS=" ${flags}" \
                                ADAFLAGS=" ${flags}" \
                                prefix="/tools" \
                                exec_prefix="/tools" \
                                GCJFLAGS=" ${flags}" \
                                CXXFLAGS="-g -O2  -D_GNU_SOURCE ${flags}" \
                                LIBCFLAGS="-O2 -g -O2   ${flags}" \
                                LIBCXXFLAGS="-g -O2  -D_GNU_SOURCE -fno-implicit-templates ${flags}" \
                                LDFLAGS=" ${flags}" \
                                MULTIFLAGS="${flags}" \
                                DESTDIR="" \
                                INSTALL="/usr/bin/install -c" \
                                INSTALL_DATA="/usr/bin/install -c -m 644" \
                                INSTALL_PROGRAM="/usr/bin/install -c" \
                                INSTALL_SCRIPT="/usr/bin/install -c" \
                                all); then \
                  true; \
                else \
                  exit 1; \
                fi; \
              else true; \
              fi; \
            fi; \
          done; \
        fi
make[3]: Leaving directory `/mnt/lfs/sources/WORK/gcc-build/i686-pc-linux-gnu/libssp'
make[2]: Leaving directory `/mnt/lfs/sources/WORK/gcc-build/i686-pc-linux-gnu/libssp'
make[2]: Entering directory `/mnt/lfs/sources/WORK/gcc-build/i686-pc-linux-gnu/libiberty'
make[3]: Entering directory `/mnt/lfs/sources/WORK/gcc-build/i686-pc-linux-gnu/libiberty/testsuite'
make[3]: Nothing to be done for `check'.
make[3]: Leaving directory `/mnt/lfs/sources/WORK/gcc-build/i686-pc-linux-gnu/libiberty/testsuite'
make[2]: Leaving directory `/mnt/lfs/sources/WORK/gcc-build/i686-pc-linux-gnu/libiberty'
make[1]: Leaving directory `/mnt/lfs/sources/WORK/gcc-build'
make: *** [do-check] Error 2
make: Target `check' not remade because of errors.